Target
5-hydroxytryptamine receptor 1B
Ligand
BDBM50024204
Substrate
Ki
640±n/a nM
Comments
PDSP_1206
Citation
 Hamblin, MWMetcalf, MAMcGuffin, RWKarpells, S Molecular cloning and functional characterization of a human 5-HT1B serotonin receptor: a homologue of the rat 5-HT1B receptor with 5-HT1D-like pharmacological specificity. Biochem Biophys Res Commun 184:752-9 (1992)  
Target
Name:
5-hydroxytryptamine receptor 1B
Synonyms:
5-HT-1B 5-HT1B 5HT1B_HUMAN HTR1DB Serotonin (5-HT) receptor Serotonin Receptor 1B
Type:
G Protein-Coupled Receptor (GPCR)
Mol. Mass.:
43579.17
Organism:
Homo sapiens (Human)
Description:
Receptor binding assays were performed using human clone stably expressed in CHO cells
Residue:
390
  
Inhibitor
Name:
BDBM50024204
Synonyms:
1H-imidazo[4,5-c]pyridine derivative 4,7-dimethyl-(6aR,9S,10aR)-4,6,6a,7,8,9,10,10a-octahydroindolo[4,3-fg]quinolin-9-amino-N,N-dimethyl sulfonamide 9-N,N-dimethylsulfamide-4,7-dimethyl-4,6,6a,7,8,9,10,10a-octahydro-indolo[4,3-fg]quinoline ChEMBL_10959 N'-4,7-Dimethyl-4,6,6a,7,8,9,10,10a-octahydro-indolo[4,3-fg]quinolin-9-yl)-N'-,N'-dimethyl-sulphonediamine
Type:
Small organic molecule
Emp. Form.:
C18H26N4O2S
Mol. Mass.:
362.49
SMILES:
CN(C)S(=O)(=O)N[C@H]1C[C@H]2[C@@H](Cc3cn(C)c4cccc2c34)N(C)C1
: