Target
HIV-1 protease
Ligand
BDBM81675
Substrate
Meas. Tech.
Inhibition Assay
Ki
260±0.0 nM
Citation
 Chellappan, SKiran Kumar Reddy, GSAli, ANalam, MNAnjum, SGCao, HKairys, VFernandes, MXAltman, MDTidor, BRana, TMSchiffer, CAGilson, MK Design of mutation-resistant HIV protease inhibitors with the substrate envelope hypothesis. Chem Biol Drug Des 69:298-313 (2007)  
Target
Name:
HIV-1 protease
Synonyms:
Type:
Protein
Mol. Mass.:
10653.94
Organism:
Human immunodeficiency virus
Description:
O90783
Residue:
98
  
Inhibitor
Name:
BDBM81675
Synonyms:
CARB-KB51
Type:
Small organic molecule
Emp. Form.:
C24H32N2O6S
Mol. Mass.:
476.586
SMILES:
C[C@@H](O)CN(C[C@@H](O)[C@H](Cc1ccccc1)NC(=O)CC1CCC=C1)S(=O)(=O)c1ccco1
: