Target
D(1A) dopamine receptor
Ligand
BDBM81871
Substrate
Ki
4600±n/a nM
Comments
PDSP_245
Citation
 Sunahara, RKGuan, HCO'Dowd, BFSeeman, PLaurier, LGNg, GGeorge, SRTorchia, JVan Tol, HHNiznik, HB Cloning of the gene for a human dopamine D5 receptor with higher affinity for dopamine than D1. Nature 350:614-9 (1991)  
Target
Name:
D(1A) dopamine receptor
Synonyms:
DA D1 receptor DRD1 Dopamine D1 receptor Dopamine D1A
Type:
Enzyme
Mol. Mass.:
49303.43
Organism:
Homo sapiens (Human)
Description:
P21728
Residue:
446
  
Inhibitor
Name:
BDBM81871
Synonyms:
ADTN, (+) NSC_16
Type:
Small organic molecule
Emp. Form.:
C12H22N2O2
Mol. Mass.:
226.3153
SMILES:
O=C1CCCCCNC(=O)CCCCCN1
: