Target
D(1A) dopamine receptor
Ligand
BDBM82247
Substrate
Ki
41±n/a nM
Comments
PDSP_1683
Citation
 Sunahara, RKGuan, HCO'Dowd, BFSeeman, PLaurier, LGNg, GGeorge, SRTorchia, JVan Tol, HHNiznik, HB Cloning of the gene for a human dopamine D5 receptor with higher affinity for dopamine than D1. Nature 350:614-9 (1991)  
Target
Name:
D(1A) dopamine receptor
Synonyms:
DA D1 receptor DRD1 Dopamine D1 receptor Dopamine D1A
Type:
Enzyme
Mol. Mass.:
49303.43
Organism:
Homo sapiens (Human)
Description:
P21728
Residue:
446
  
Inhibitor
Name:
BDBM82247
Synonyms:
8-Chloro-3-methyl-5-phenyl-2,3,4,5-tetrahydro-1H-benzo[d]azepin-7-ol(SCH 23390) CHEMBL2158641 SCH 23388 SCH 23390 (R-enantiomer) | SCH 23390,R(+)
Type:
Small organic molecule
Emp. Form.:
C17H18ClNO
Mol. Mass.:
287.784
SMILES:
CN1CCc2cc(Cl)c(O)cc2[C@H](C1)c1ccccc1
: