Target
D(1B) dopamine receptor
Ligand
BDBM81872
Substrate
Ki
113±n/a nM
Comments
PDSP_794
Citation
 Sunahara, RKGuan, HCO'Dowd, BFSeeman, PLaurier, LGNg, GGeorge, SRTorchia, JVan Tol, HHNiznik, HB Cloning of the gene for a human dopamine D5 receptor with higher affinity for dopamine than D1. Nature 350:614-9 (1991)  
Target
Name:
D(1B) dopamine receptor
Synonyms:
D(5) dopamine receptor DOPAMINE D5 DRD1L2 DRD5_HUMAN | dopamine receptor D5
Type:
Protein
Mol. Mass.:
52943.41
Organism:
Homo sapiens (Human)
Description:
P21918
Residue:
477
  
Inhibitor
Name:
BDBM81872
Synonyms:
CAS_161309 NSC_161309
Type:
Small organic molecule
Emp. Form.:
C32H41N5O5
Mol. Mass.:
575.6984
SMILES:
CCC(C)C1N2C(=O)C(NC(=O)C3CN(C)C4Cc5c[nH]c6cccc(C4=C3)c56)(OC2(O)C2CCCN2C1=O)C(C)C
: