Target
ATP synthase subunit a
Ligand
BDBM50194558
Substrate
Ki
3±n/a nM
Comments
PDSP_778
Citation
 Burcher, EBuck, SHLovenberg, WO'Donohue, TL Characterization and autoradiographic localization of multiple tachykinin binding sites in gastrointestinal tract and bladder. J Pharmacol Exp Ther 236:819-31 (1986) Target
Name:
ATP synthase subunit a
Synonyms:
ATP synthase subunit a Atp6 BHE Mtatp6
Type:
Enzyme Catalytic Domain
Mol. Mass.:
25083.82
Organism:
RAT
Description:
P05504
Residue:
226
  
Inhibitor
Name:
BDBM50194558
Synonyms:
CHEMBL373569 | ELEDOISIN
Type:
Small organic molecule
Emp. Form.:
C54H85N13O15S
Mol. Mass.:
1188.396
SMILES:
CC[C@H](C)[C@H](NC(=O)[C@H](Cc1ccccc1)NC(=O)[C@H](C)NC(=O)[C@H](CC(O)=O)NC(=O)[C@H](CCCCN)NC(=O)[C@H](CO)NC(=O)[C@@H]1CCCN1C(=O)[C@@H]1CCC(=O)N1)C(=O)NCC(=O)N[C@@H](CC(C)C)C(=O)N[C@@H](CCSC)C(N)=O
: