Target
Protachykinin-1
Ligand
BDBM81942
Substrate
Ki
4±n/a nM
Comments
PDSP_1774
Citation
 Burcher, EBuck, SHLovenberg, WO'Donohue, TL Characterization and autoradiographic localization of multiple tachykinin binding sites in gastrointestinal tract and bladder. J Pharmacol Exp Ther 236:819-31 (1986) Target
Name:
Protachykinin-1
Synonyms:
Nka Protachykinin-1 Substance P Tac1 | Tac2
Type:
Enzyme Catalytic Domain
Mol. Mass.:
15050.06
Organism:
MOUSE
Description:
Substance K 0 MOUSE::P41539
Residue:
130
  
Inhibitor
Name:
BDBM81942
Synonyms:
CAS_55582 NSC_55582 Substance K
Type:
Small organic molecule
Emp. Form.:
C50H80N14O14S
Mol. Mass.:
1133.321
SMILES:
CSCCC(NC(=O)C(CC(C)C)NC(=O)CNC(=O)C(NC(=O)C(Cc1ccccc1)NC(=O)C(CO)NC(=O)C(CC(O)=O)NC(=O)C(NC(=O)C(CCCCN)NC(=O)C(N)Cc1cnc[nH]1)C(C)O)C(C)C)C(N)=O
: