Target
D(1A) dopamine receptor
Ligand
BDBM50048392
Substrate
Ki
>10000±n/a nM
Comments
PDSP_444
Citation
 Andersen, PH The dopamine inhibitor GBR 12909: selectivity and molecular mechanism of action. Eur J Pharmacol 166:493-504 (1989)  
Target
Name:
D(1A) dopamine receptor
Synonyms:
DOPAMINE D1 Dopamine D1 high Dopamine receptor Dopamine1-like Drd1a
Type:
Enzyme Catalytic Domain
Mol. Mass.:
49429.75
Organism:
RAT
Description:
P18901
Residue:
446
  
Inhibitor
Name:
BDBM50048392
Synonyms:
2-(tert-butylamino)-1-(3-chlorophenyl)propan-1-one BUPROPION HYDROCHLORIDE US9944618, Compound ID No. 176
Type:
Small organic molecule
Emp. Form.:
C13H18ClNO
Mol. Mass.:
239.741
SMILES:
CC(NC(C)(C)C)C(=O)c1cccc(Cl)c1
: