Target
Leucyl-cystinyl aminopeptidase
Ligand
BDBM271258
Substrate
Meas. Tech.
Inhibition of Human P-LAP (hP-LAP) Assay
IC50
1.60±n/a nM
Citation
 Kawaguchi, KIshihata, AInagaki, YTsuchiya, KHanadate, TKanai, AKaizawa, HKazami, JMorikawa, HHiramoto, MEnjo, KTakamatsu, H Pyridine derivative US Patent  US10059720 Publication Date 8/28/2018 
Target
Name:
Leucyl-cystinyl aminopeptidase
Synonyms:
Aminopeptidase Cystinyl aminopeptidase Insulin-regulated membrane aminopeptidase LCAP_HUMAN Leucyl-cystinyl aminopeptidase, pregnancy serum form Oxytocinase Placental leucine aminopeptidase
Type:
PROTEIN
Mol. Mass.:
117334.10
Organism:
Homo sapiens (Human)
Description:
ChEMBL_1473494
Residue:
1025
  
Inhibitor
Name:
BDBM271258
Synonyms:
US10059720, Example 73 | US10975091, Example 73
Type:
Small organic molecule
Emp. Form.:
C21H34N2O4
Mol. Mass.:
378.5057
SMILES:
CC(C)C[C@H](N)[C@](O)(Cc1cc(O[C@H]2CC[C@H](C)CC2)c(C)cn1)C(O)=O
: