Target
Leucyl-cystinyl aminopeptidase
Ligand
BDBM271290
Substrate
Meas. Tech.
Inhibition of Human P-LAP (hP-LAP) Assay
IC50
1.90±n/a nM
Citation
 Kawaguchi, KIshihata, AInagaki, YTsuchiya, KHanadate, TKanai, AKaizawa, HKazami, JMorikawa, HHiramoto, MEnjo, KTakamatsu, H Pyridine derivative US Patent  US10059720 Publication Date 8/28/2018 
Target
Name:
Leucyl-cystinyl aminopeptidase
Synonyms:
Aminopeptidase Cystinyl aminopeptidase Insulin-regulated membrane aminopeptidase LCAP_HUMAN Leucyl-cystinyl aminopeptidase, pregnancy serum form Oxytocinase Placental leucine aminopeptidase
Type:
PROTEIN
Mol. Mass.:
117334.10
Organism:
Homo sapiens (Human)
Description:
ChEMBL_1473494
Residue:
1025
  
Inhibitor
Name:
BDBM271290
Synonyms:
US10059720, Example 105 | US10975091, Example 105
Type:
Small organic molecule
Emp. Form.:
C19H30N2O4S
Mol. Mass.:
382.518
SMILES:
CCSC[C@H](N)[C@](O)(Cc1cc(O[C@H]2CC[C@H](C)CC2)ccn1)C(O)=O
: