Target
Sodium-dependent dopamine transporter
Ligand
BDBM22199
Substrate
Ki
4±n/a nM
Comments
PDSP_3885
Citation
 Hyttel, JLarsen, JJ Neurochemical profile of Lu 19-005, a potent inhibitor of uptake of dopamine, noradrenaline, and serotonin. J Neurochem 44:1615-22 (1985)  
Target
Name:
Sodium-dependent dopamine transporter
Synonyms:
DA transporter SC6A3_RAT Sodium-dependent dopamine transporter | Sodium-dependent dopamine transporter (DAT)
Type:
Multi-pass membrane protein
Mol. Mass.:
68749.45
Organism:
Rattus norvegicus (rat)
Description:
P23977
Residue:
619
  
Inhibitor
Name:
BDBM22199
Synonyms:
1-{2-[bis(4-fluorophenyl)methoxy]ethyl}-4-[(2E)-3-phenylprop-2-en-1-yl]piperazine CHEMBL286991 GBR-13,069
Type:
Small organic molecule
Emp. Form.:
C28H30F2N2O
Mol. Mass.:
448.5474
SMILES:
Fc1ccc(cc1)C(OCCN1CCN(C\C=C\c2ccccc2)CC1)c1ccc(F)cc1
: