Target
Beta-2 adrenergic receptor
Ligand
BDBM81957
Substrate
Ki
>10000±n/a nM
Comments
PDSP_5057
Citation
 Glennon, RAIsmaiel, AEMcCarthy, BGPeroutka, SJ Binding of arylpiperazines to 5-HT3 serotonin receptors: results of a structure-affinity study. Eur J Pharmacol 168:387-92 (1989)  
Target
Name:
Beta-2 adrenergic receptor
Synonyms:
ADRB2_RAT Adrb2r | Adrenergic receptor beta
Type:
PROTEIN
Mol. Mass.:
46896.26
Organism:
Rattus norvegicus
Description:
ChEMBL_38603
Residue:
418
  
Inhibitor
Name:
BDBM81957
Synonyms:
QUIPAZINE,8-Me
Type:
Small organic molecule
Emp. Form.:
C14H17N3
Mol. Mass.:
227.3049
SMILES:
Cc1cccc2ccc(nc12)N1CCNCC1
: