Target
5-hydroxytryptamine receptor 1E
Ligand
BDBM50007871
Substrate
Ki
>10000±n/a nM
Comments
PDSP_956
Citation
 Leonhardt, SHerrick-Davis, KTiteler, M Detection of a novel serotonin receptor subtype (5-HT1E) in human brain: interaction with a GTP-binding protein. J Neurochem 53:465-71 (1989)  
Target
Name:
5-hydroxytryptamine receptor 1E
Synonyms:
5-HT-1E 5-Hydroxytryptamine Receptor Subtype 1E (5HT1E) 5-hydroxytryptamine receptor 1E (5-HT-1E) (S31) 5HT1E_HUMAN S31 Serotonin 1e (5-HT1e) receptor | Serotonin Receptor 1E
Type:
G Protein-Coupled Receptor (GPCR)
Mol. Mass.:
41697.80
Organism:
Homo sapiens (Human)
Description:
gi_112822
Residue:
365
  
Inhibitor
Name:
BDBM50007871
Synonyms:
CHEMBL8197 TROPISETRON
Type:
Small organic molecule
Emp. Form.:
C17H20N2O2
Mol. Mass.:
284.3529
SMILES:
CN1C2CCC1CC(C2)OC(=O)c1c[nH]c2ccccc12
: