Target
Muscarinic acetylcholine receptor M5
Ligand
BDBM81959
Substrate
Ki
3.7±n/a nM
Comments
PDSP_940
Citation
 Buckley, NJBonner, TIBuckley, CMBrann, MR Antagonist binding properties of five cloned muscarinic receptors expressed in CHO-K1 cells. Mol Pharmacol 35:469-76 (1989) Target
Name:
Muscarinic acetylcholine receptor M5
Synonyms:
ACM5_HUMAN | CHRM5
Type:
PROTEIN
Mol. Mass.:
60102.35
Organism:
Homo sapiens (Human)
Description:
ChEMBL_1517990
Residue:
532
  
Inhibitor
Name:
BDBM81959
Synonyms:
CAS_115-63-9 | Hexocyclium
Type:
Small organic molecule
Emp. Form.:
C20H33N2O
Mol. Mass.:
317.4883
SMILES:
C[N+]1(C)CCN(CC(O)(C2CCCCC2)c2ccccc2)CC1
: