Target
Gastrin/cholecystokinin type B receptor
Ligand
BDBM50061220
Substrate
Ki
3.9±n/a nM
Comments
PDSP_2199
Citation
 Lotti, VJChang, RS A new potent and selective non-peptide gastrin antagonist and brain cholecystokinin receptor (CCK-B) ligand: L-365,260. Eur J Pharmacol 162:273-80 (1989)  
Target
Name:
Gastrin/cholecystokinin type B receptor
Synonyms:
Cckbr Cholecystokinin B receptor GASR_RAT | Gastrin/cholecystokinin type B receptor
Type:
Enzyme Catalytic Domain
Mol. Mass.:
48980.43
Organism:
RAT
Description:
Cholecystokinin A CCKBR RAT::P30553
Residue:
452
  
Inhibitor
Name:
BDBM50061220
Synonyms:
1-((S)-1-Methyl-2-oxo-5-phenyl-2,3-dihydro-1H-benzo[e][1,4]diazepin-3-yl)-3-m-tolyl-urea 1-(1-Methyl-2-oxo-5-phenyl-2,3-dihydro-1H-benzo[e][1,4]diazepin-3-yl)-3-m-tolyl-urea((S)L365_260) L-365,260
Type:
Small organic molecule
Emp. Form.:
C24H22N4O2
Mol. Mass.:
398.4571
SMILES:
CN1c2ccccc2C(=N[C@H](NC(=O)Nc2cccc(C)c2)C1=O)c1ccccc1
: