Target
Alpha-1A adrenergic receptor
Ligand
BDBM50026636
Substrate
Ki
4000±n/a nM
Comments
PDSP_1590
Citation
 Hieble, JPDeMarinis, RMFowler, PJMatthews, WD Selective alpha-2 adrenoceptor blockade by SK&F 86466: in vitro characterization of receptor selectivity. J Pharmacol Exp Ther 236:90-6 (1986) Target
Name:
Alpha-1A adrenergic receptor
Synonyms:
ADA1A_RABIT ADRA1C | adrenergic Alpha1
Type:
Enzyme Catalytic Domain
Mol. Mass.:
51390.87
Organism:
RABBIT
Description:
adrenergic Alpha1 0 RABBIT::O02824
Residue:
466
  
Inhibitor
Name:
BDBM50026636
Synonyms:
17alpha-hydroxy-20alpha-yohimban-16beta-carboxylic acid methyl ester RAUWOLSCINE HYDROCHLORIDE corynanthidine mesoyohimbine methyl 17alpha-hydroxy-20alpha-yohimban-16beta-carboxylate | rauwolscine
Type:
Small organic molecule
Emp. Form.:
C21H26N2O3
Mol. Mass.:
354.4427
SMILES:
COC(=O)[C@@H]1[C@@H](O)CC[C@@H]2CN3CCc4c([nH]c5ccccc45)[C@@H]3C[C@H]12
: