Target
5-hydroxytryptamine receptor 2A
Ligand
BDBM50001888
Substrate
Ki
31±n/a nM
Comments
PDSP_513
Citation
 Hall, HSällemark, MJerning, E Effects of remoxipride and some related new substituted salicylamides on rat brain receptors. Acta Pharmacol Toxicol (Copenh) 58:61-70 (1986)  
Target
Name:
5-hydroxytryptamine receptor 2A
Synonyms:
5-HT-2A 5-HT2A 5-hydroxytryptamine receptor 2A (5HT2A) Htr2 Serotonin Receptor 2A
Type:
G Protein-Coupled Receptor (GPCR)
Mol. Mass.:
52852.05
Organism:
Rattus norvegicus (rat)
Description:
Rat cortex membranes 5-HT2A receptors.
Residue:
471
  
Inhibitor
Name:
BDBM50001888
Synonyms:
(chloropromazine) [3-(2-Chloro-phenothiazin-10-yl)-propyl]-dimethyl-amine 1-(2-Allyl-phenoxy)-3-isopropylamino-propan-2-ol 3-(2-chloro-10H-phenothiazin-10-yl)-N,N-dimethylpropan-1-amine CHLORPROMAZINE CHLORPROMAZINE HYDROCHLORIDE CHLORPROMAZINE TANNATE PROMAPAR THORAZINE [3-(2-Chloro-phenothiazin-10-yl)-propyl]-dimethyl-amine( Chlorpromazine) chloropromazine | med.21724, Compound 15
Type:
Small organic molecule
Emp. Form.:
C17H19ClN2S
Mol. Mass.:
318.864
SMILES:
CN(C)CCCN1c2ccccc2Sc2ccc(Cl)cc12
: