Target
5-hydroxytryptamine receptor 2A
Ligand
BDBM50002338
Substrate
Ki
55±n/a nM
Comments
PDSP_1849
Citation
 Hall, HSällemark, MJerning, E Effects of remoxipride and some related new substituted salicylamides on rat brain receptors. Acta Pharmacol Toxicol (Copenh) 58:61-70 (1986)  
Target
Name:
5-hydroxytryptamine receptor 2A
Synonyms:
5-HT-2A 5-HT2A 5-hydroxytryptamine receptor 2A (5HT2A) Htr2 Serotonin Receptor 2A
Type:
G Protein-Coupled Receptor (GPCR)
Mol. Mass.:
52852.05
Organism:
Rattus norvegicus (rat)
Description:
Rat cortex membranes 5-HT2A receptors.
Residue:
471
  
Inhibitor
Name:
BDBM50002338
Synonyms:
(Thioridazine)10-[2-(1-Methyl-piperidin-2-yl)-ethyl]-2-methylsulfanyl-10H-phenothiazine 10-[2-(1-Methyl-piperidin-2-yl)-ethyl]-2-methylsulfanyl-10H-phenothiazine CHEMBL479 MELLARIL-S TP-21 | US9504692, Thioridazine
Type:
Small organic molecule
Emp. Form.:
C21H26N2S2
Mol. Mass.:
370.575
SMILES:
CSc1ccc2Sc3ccccc3N(CCC3CCCCN3C)c2c1
: