Target
D(1A) dopamine receptor
Ligand
BDBM50026044
Substrate
Ki
41±n/a nM
Comments
PDSP_2280
Citation
 Hall, HSällemark, MJerning, E Effects of remoxipride and some related new substituted salicylamides on rat brain receptors. Acta Pharmacol Toxicol (Copenh) 58:61-70 (1986)  
Target
Name:
D(1A) dopamine receptor
Synonyms:
DOPAMINE D1 Dopamine D1 high Dopamine receptor Dopamine1-like Drd1a
Type:
Enzyme Catalytic Domain
Mol. Mass.:
49429.75
Organism:
RAT
Description:
P18901
Residue:
446
  
Inhibitor
Name:
BDBM50026044
Synonyms:
3-Bromo-5-ethyl-N-(1-ethyl-pyrrolidin-2-ylmethyl)-6-hydroxy-2-methoxy-benzamide CHEMBL161668
Type:
Small organic molecule
Emp. Form.:
C17H25BrN2O3
Mol. Mass.:
385.296
SMILES:
CCN1CCC[C@H]1CNC(=O)c1c(O)c(CC)cc(Br)c1OC
: