Target
D(2) dopamine receptor
Ligand
BDBM50026053
Substrate
Ki
16±n/a nM
Comments
PDSP_2277
Citation
 Hall, HSällemark, MJerning, E Effects of remoxipride and some related new substituted salicylamides on rat brain receptors. Acta Pharmacol Toxicol (Copenh) 58:61-70 (1986)  
Target
Name:
D(2) dopamine receptor
Synonyms:
DOPAMINE D2 DOPAMINE D2 Short Dopamine D2 receptor Drd2
Type:
G Protein-Coupled Receptor (GPCR)
Mol. Mass.:
50931.60
Organism:
Rattus norvegicus (rat)
Description:
P61169
Residue:
444
  
Inhibitor
Name:
BDBM50026053
Synonyms:
3,5-Dibromo-N-(1-ethyl-pyrrolidin-2-ylmethyl)-2-hydroxy-6-methoxy-benzamide A 36569 | CHEMBL303334
Type:
Small organic molecule
Emp. Form.:
C15H20Br2N2O3
Mol. Mass.:
436.139
SMILES:
CCN1CCC[C@H]1CNC(=O)c1c(O)c(Br)cc(Br)c1OC
: