Target
D(2) dopamine receptor
Ligand
BDBM50026045
Substrate
Ki
2030±n/a nM
Comments
PDSP_1593
Citation
 Hall, HSällemark, MJerning, E Effects of remoxipride and some related new substituted salicylamides on rat brain receptors. Acta Pharmacol Toxicol (Copenh) 58:61-70 (1986)  
Target
Name:
D(2) dopamine receptor
Synonyms:
DOPAMINE D2 DOPAMINE D2 Short Dopamine D2 receptor Drd2
Type:
G Protein-Coupled Receptor (GPCR)
Mol. Mass.:
50931.60
Organism:
Rattus norvegicus (rat)
Description:
P61169
Residue:
444
  
Inhibitor
Name:
BDBM50026045
Synonyms:
(R,S)-3-Bromo-N-(1-ethyl-pyrrolidin-2-ylmethyl)-2,6-dimethoxy-benzamide 3-Bromo-N-((R)-1-ethyl-pyrrolidin-2-ylmethyl)-2,6-dimethoxy-benzamide 3-Bromo-N-(1-ethyl-pyrrolidin-2-ylmethyl)-2,6-dimethoxy-benzamide 3-Bromo-N-(1-ethyl-pyrrolidin-2-ylmethyl)-2,6-dimethoxy-benzamide(remoxipride) REMOXIPRIDE
Type:
Small organic molecule
Emp. Form.:
C16H23BrN2O3
Mol. Mass.:
371.269
SMILES:
CCN1CCC[C@H]1CNC(=O)c1c(OC)ccc(Br)c1OC
: