Target
Sigma non-opioid intracellular receptor 1
Ligand
BDBM81982
Substrate
Ki
28±n/a nM
Comments
PDSP_3945
Citation
 Korstanje, CSprenkels, RDoods, HNHugtenburg, JGBoddeke, EBatink, HDThoolen, MJVan Zwieten, PA Characterization of flufylline, fluprofylline, ritanserin, butanserin and R 56413 with respect to in-vivo alpha 1-,alpha 2- and 5-HT2-receptor antagonism and in-vitro affinity for alpha 1-,alpha 2- and 5-HT2-receptors: comparison with ketanserin. J Pharm Pharmacol 38:374-9 (1986)  
Target
Name:
Sigma non-opioid intracellular receptor 1
Synonyms:
OPRS1 SIGMAR1 Sigma non-opioid intracellular receptor 1 Sigma1-receptor Sterol isomerase-like protein
Type:
Protein
Mol. Mass.:
25307.17
Organism:
Cavia porcellus (Guinea pig)
Description:
Q60492
Residue:
223
  
Inhibitor
Name:
BDBM81982
Synonyms:
CAS_97-39-2 DTG Tol2Gdn | cid_7333
Type:
Small organic molecule
Emp. Form.:
C15H17N3
Mol. Mass.:
239.3156
SMILES:
Cc1ccccc1NC(N)=Nc1ccccc1C
: