Target
Alpha-1A adrenergic receptor
Ligand
BDBM30712
Substrate
Ki
33±n/a nM
Comments
PDSP_1428
Citation
 Jones, SBSmith, JMJones, AWBylund, DB Alpha-1 adrenergic receptor binding in aortas from rat and dog: comparison of [3H]prazosin and beta-iodo-[125I]-4-hydroxyphenyl-ethyl-aminomethyl-tetralone. J Pharmacol Exp Ther 241:875-81 (1987) Target
Name:
Alpha-1A adrenergic receptor
Synonyms:
ADA1A_CANLF ADRA1C | adrenergic Alpha1
Type:
Enzyme Catalytic Domain
Mol. Mass.:
32268.65
Organism:
Dog
Description:
adrenergic Alpha1 0 Dog::O77621
Residue:
295
  
Inhibitor
Name:
BDBM30712
Synonyms:
6-tert-butyl-3-(2-imidazolin-2-ylmethyl)-2,4-dimethyl-phenol;hydrochloride 6-tert-butyl-3-(4,5-dihydro-1H-imidazol-2-ylmethyl)-2,4-dimethylphenol;hydrochloride Oxymetazoline cid_66259
Type:
Small organic molecule
Emp. Form.:
C16H24N2O
Mol. Mass.:
260.3746
SMILES:
Cc1cc(c(O)c(C)c1CC1=NCCN1)C(C)(C)C
: