Target
Histamine H1 receptor
Ligand
BDBM67545
Substrate
Ki
2±n/a nM
Comments
PDSP_1532
Citation
 Richelson, E Neuroleptic binding to human brain receptors: relation to clinical effects. Ann N Y Acad Sci 537:435-42 (1988)  
Target
Name:
Histamine H1 receptor
Synonyms:
H1R HISTAMINE H1 HRH1_HUMAN
Type:
G Protein-Coupled Receptor (GPCR)
Mol. Mass.:
55808.72
Organism:
Homo sapiens (Human)
Description:
Cell pellets from SK-N-MC cells transfected with human H1 receptor were used in binding assay.
Residue:
487
  
Inhibitor
Name:
BDBM67545
Synonyms:
N,N-dimethyl-3-(10-phenothiazinyl)-1-propanamine;hydrochloride N,N-dimethyl-3-phenothiazin-10-ylpropan-1-amine;hydrochloride SR-01000000228-4 cid_5887 | dimethyl(3-phenothiazin-10-ylpropyl)amine;hydrochloride
Type:
Small organic molecule
Emp. Form.:
C17H20N2S
Mol. Mass.:
284.419
SMILES:
CN(C)CCCN1c2ccccc2Sc2ccccc12
: