Target
Mu-type opioid receptor
Ligand
BDBM82064
Substrate
Ki
1160±n/a nM
Comments
PDSP_7115
Citation
 Blanchard, SGLee, PHPugh, WWHong, JSChang, KJ Characterization of the binding of a morphine (mu) receptor-specific ligand: Tyr-Pro-NMePhe-D-Pro-NH2, [3H]-PL17. Mol Pharmacol 31:326-33 (1987) Target
Name:
Mu-type opioid receptor
Synonyms:
MOR-1 Mu-type opioid receptor (MOR) OPRM_RAT Opioid receptor B Ror-b
Type:
G Protein-Coupled Receptor (GPCR)
Mol. Mass.:
44503.11
Organism:
Rattus norvegicus (rat)
Description:
Competition binding assays were carried out using membrane preparations from transfected HN9.10 cells that constitutively expressed the mu opioid receptor.
Residue:
398
  
Inhibitor
Name:
BDBM82064
Synonyms:
CAS_79805-24-6 beta-Casomorphin
Type:
Small organic molecule
Emp. Form.:
C28H35N5O5
Mol. Mass.:
521.608
SMILES:
NC(Cc1ccc(O)cc1)C(=O)N1CCCC1C(=O)NC(Cc1ccccc1)C(=O)N1CCCC1C(N)=O
: