Target
Mu-type opioid receptor
Ligand
BDBM50209301
Substrate
Ki
16.1±n/a nM
Comments
PDSP_7116
Citation
 Blanchard, SGLee, PHPugh, WWHong, JSChang, KJ Characterization of the binding of a morphine (mu) receptor-specific ligand: Tyr-Pro-NMePhe-D-Pro-NH2, [3H]-PL17. Mol Pharmacol 31:326-33 (1987) Target
Name:
Mu-type opioid receptor
Synonyms:
MOR-1 Mu-type opioid receptor (MOR) OPRM_RAT Opioid receptor B Ror-b
Type:
G Protein-Coupled Receptor (GPCR)
Mol. Mass.:
44503.11
Organism:
Rattus norvegicus (rat)
Description:
Competition binding assays were carried out using membrane preparations from transfected HN9.10 cells that constitutively expressed the mu opioid receptor.
Residue:
398
  
Inhibitor
Name:
BDBM50209301
Synonyms:
(S)-1-((S)-2-amino-3-(4-hydroxyphenyl)propanoyl)-N-((S)-1-((S)-1-amino-3-methyl-1-oxobutan-2-ylamino)-1-oxo-3-phenylpropan-2-yl)pyrrolidine-2-carboxamide Morphiceptin [Val4]
Type:
Small organic molecule
Emp. Form.:
C28H37N5O5
Mol. Mass.:
523.6239
SMILES:
CC(C)[C@H](NC(=O)[C@H](Cc1ccccc1)NC(=O)[C@@H]1CCCN1C(=O)[C@@H](N)Cc1ccc(O)cc1)C(N)=O
: