Target
5-hydroxytryptamine receptor 2C
Ligand
BDBM50001775
Substrate
Ki
0.2±n/a nM
Comments
PDSP_1602
Citation
 Sanders-Bush, EBreeding, M Putative selective 5-HT-2 antagonists block serotonin 5-HT-1c receptors in the choroid plexus. J Pharmacol Exp Ther 247:169-73 (1988) Target
Name:
5-hydroxytryptamine receptor 2C
Synonyms:
5-HT2C 5-hydroxytryptamine receptor 2C (5HT2c) 5ht1c Htr2c Serotonin receptor 2a and 2c (5HT2A and 5HT2C)
Type:
Enzyme
Mol. Mass.:
51935.10
Organism:
Rattus norvegicus (Rat)
Description:
P08909
Residue:
460
  
Inhibitor
Name:
BDBM50001775
Synonyms:
(ritanserin)6-(2-{4-[Bis-(4-fluoro-phenyl)-methylene]-piperidin-1-yl}-ethyl)-7-methyl-2,3-dihydro-1H-indolizin-5-one 6-(2-(4-(bis(4-fluorophenyl)methylene)piperidin-1-yl)ethyl)-7-methyl-5H-thiazolo[3,2-a]pyrimidin-5-one 6-(2-{4-[Bis-(4-fluoro-phenyl)-methylene]-piperidin-1-yl}-ethyl)-7-methyl-thiazolo[3,2-a]pyrimidin-5-one 6-(2-{4-[Bis-(4-fluoro-phenyl)-methylene]-piperidin-1-yl}-ethyl)-7-methyl-thiazolo[3,2-a]pyrimidin-5-one(Ritanserin) RITANSERIN cid_5074
Type:
Small organic molecule
Emp. Form.:
C27H25F2N3OS
Mol. Mass.:
477.569
SMILES:
[#6]-c1nc2sccn2c(=O)c1-[#6]-[#6]-[#7]-1-[#6]-[#6]\[#6](-[#6]-[#6]-1)=[#6](\c1ccc(F)cc1)-c1ccc(F)cc1
: