Target
Histamine H1 receptor
Ligand
BDBM35229
Substrate
Ki
124±n/a nM
Comments
PDSP_638
Citation
 Muth, EAHaskins, JTMoyer, JAHusbands, GENielsen, STSigg, EB Antidepressant biochemical profile of the novel bicyclic compound Wy-45,030, an ethyl cyclohexanol derivative. Biochem Pharmacol 35:4493-7 (1986)  
Target
Name:
Histamine H1 receptor
Synonyms:
HISTAMINE H1 Hrh1
Type:
Enzyme Catalytic Domain
Mol. Mass.:
55716.35
Organism:
RAT
Description:
HISTAMINE H1 HRH1 RAT::P31390
Residue:
486
  
Inhibitor
Name:
BDBM35229
Synonyms:
3-(10,11-dihydro-5H-dibenzo[b,f]azepin-5-yl)-N-methylpropan-1-amine CHEMBL72 DMI Desipramine N-(3-methylaminopropyl)iminobibenzyl demethylimipramine norimipramine
Type:
Small organic molecule
Emp. Form.:
C18H22N2
Mol. Mass.:
266.3807
SMILES:
CNCCCN1c2ccccc2CCc2ccccc12
: