Target
Protein kinase C beta type
Ligand
BDBM3041
Substrate
Lysine-rich histone
Meas. Tech.
MLCK assay
IC50
30±n/a nM
Citation
 Kleinschroth, JHartenstein, JRudolph, CSchachtele, C Novel Indolocarbazole protein kinase C inhibitors with improved biochemical and physicochemical properties. Bioorg Med Chem Lett 5:55-60 (1995)    Article 
Target
Name:
Protein kinase C beta type
Synonyms:
KPCB_RAT Pkcb Prkcb1 Protein kinase C (PKC) | Protein kinase C beta
Type:
Enzyme Mixture
Mol. Mass.:
76755.54
Organism:
Rattus norvegicus (rat)
Description:
PKC from rat brain is known to contain predominately the conventional PKC isoforms, alpha, beta I, beta II, gamma.
Residue:
671
  
Inhibitor
Name:
BDBM3041
Synonyms:
23-[3-(dimethylamino)-2-hydroxypropyl]-3-methyl-3,13,23-triazahexacyclo[14.7.0.0^{2,10}.0^{4,9}.0^{11,15}.0^{17,22}]tricosa-1(16),2(10),4,6,8,11(15),17(22),18,20-nonaen-12-one Indolocarbazole deriv.
Type:
Small organic molecule
Emp. Form.:
C26H26N4O2
Mol. Mass.:
426.5102
SMILES:
CN(C)CC(O)Cn1c2ccccc2c2c3CNC(=O)c3c3c4ccccc4n(C)c3c12
:
Substrate
Name:
Lysine-rich histone
Synonyms:
ING Peptide histone type IIIS
Type:
Peptide
Mol. Mass.:
10508.21
Organism:
Bos taurus (bovine)
Description:
Purified as a lysine rich fraction of histone H1 from calf thymus.
Residue:
105