Target
Protein kinase C beta type
Ligand
BDBM3046
Substrate
Lysine-rich histone
Meas. Tech.
MLCK assay
IC50
6±n/a nM
Citation
 Kleinschroth, JHartenstein, JRudolph, CSchachtele, C Novel Indolocarbazole protein kinase C inhibitors with improved biochemical and physicochemical properties. Bioorg Med Chem Lett 5:55-60 (1995)    Article 
Target
Name:
Protein kinase C beta type
Synonyms:
KPCB_RAT Pkcb Prkcb1 Protein kinase C (PKC) | Protein kinase C beta
Type:
Enzyme Mixture
Mol. Mass.:
76755.54
Organism:
Rattus norvegicus (rat)
Description:
PKC from rat brain is known to contain predominately the conventional PKC isoforms, alpha, beta I, beta II, gamma.
Residue:
671
  
Inhibitor
Name:
BDBM3046
Synonyms:
3-{7,19-dimethoxy-23-methyl-12,14-dioxo-3,13,23-triazahexacyclo[14.7.0.0^{2,10}.0^{4,9}.0^{11,15}.0^{17,22}]tricosa-1(16),2(10),4(9),5,7,11(15),17,19,21-nonaen-3-yl}propanenitrile | Indolocarbazole deriv. 3n
Type:
Small organic molecule
Emp. Form.:
C26H20N4O4
Mol. Mass.:
452.4614
SMILES:
COc1ccc2n(C)c3c(c4C(=O)NC(=O)c4c4c5cc(OC)ccc5n(CCC#N)c34)c2c1
:
Substrate
Name:
Lysine-rich histone
Synonyms:
ING Peptide histone type IIIS
Type:
Peptide
Mol. Mass.:
10508.21
Organism:
Bos taurus (bovine)
Description:
Purified as a lysine rich fraction of histone H1 from calf thymus.
Residue:
105