Target
Phosphopantetheine adenylyltransferase
Ligand
BDBM82155
Substrate
Meas. Tech.
High-Throughput Screening Assay (Forward Direction Assay)
IC50
9.2e+4±n/a nM
Citation
 Miller, JRThanabal, VMelnick, MMLall, MDonovan, CSarver, RWLee, DYOhren, JEmerson, D The use of biochemical and biophysical tools for triage of high-throughput screening hits - A case study with Escherichia coli phosphopantetheine adenylyltransferase. Chem Biol Drug Des 75:444-54 (2010)  
Target
Name:
Phosphopantetheine adenylyltransferase
Synonyms:
COAD_ECOLI Pantetheine-phosphate adenylyltransferase coaD yicA
Type:
Protein
Mol. Mass.:
17838.96
Organism:
Escherichia coli
Description:
P0A6I6
Residue:
159
  
Inhibitor
Name:
BDBM82155
Synonyms:
7-substituted pyrazoloquinolone, 14
Type:
Small organic molecule
Emp. Form.:
C12H9N3O5S
Mol. Mass.:
307.282
SMILES:
CS(=O)(=O)c1ccc2nc3cc([nH]n3c(=O)c2c1)C(O)=O
: