Target
Phosphopantetheine adenylyltransferase
Ligand
BDBM82156
Substrate
Meas. Tech.
High-Throughput Screening Assay (Forward Direction Assay)
IC50
1.4e+4±n/a nM
Citation
 Miller, JRThanabal, VMelnick, MMLall, MDonovan, CSarver, RWLee, DYOhren, JEmerson, D The use of biochemical and biophysical tools for triage of high-throughput screening hits - A case study with Escherichia coli phosphopantetheine adenylyltransferase. Chem Biol Drug Des 75:444-54 (2010)  
Target
Name:
Phosphopantetheine adenylyltransferase
Synonyms:
COAD_ECOLI Pantetheine-phosphate adenylyltransferase coaD yicA
Type:
Protein
Mol. Mass.:
17838.96
Organism:
Escherichia coli
Description:
P0A6I6
Residue:
159
  
Inhibitor
Name:
BDBM82156
Synonyms:
7-substituted pyrazoloquinolone, 15
Type:
Small organic molecule
Emp. Form.:
C14H13N3O3S
Mol. Mass.:
303.336
SMILES:
CC(C)Sc1ccc2nc3cc([nH]n3c(=O)c2c1)C(O)=O
: