Target
Phosphopantetheine adenylyltransferase
Ligand
BDBM82159
Substrate
Meas. Tech.
High-Throughput Screening Assay (Forward Direction Assay)
IC50
1.60e+5±n/a nM
Citation
 Miller, JRThanabal, VMelnick, MMLall, MDonovan, CSarver, RWLee, DYOhren, JEmerson, D The use of biochemical and biophysical tools for triage of high-throughput screening hits - A case study with Escherichia coli phosphopantetheine adenylyltransferase. Chem Biol Drug Des 75:444-54 (2010)  
Target
Name:
Phosphopantetheine adenylyltransferase
Synonyms:
COAD_ECOLI Pantetheine-phosphate adenylyltransferase coaD yicA
Type:
Protein
Mol. Mass.:
17838.96
Organism:
Escherichia coli
Description:
P0A6I6
Residue:
159
  
Inhibitor
Name:
BDBM82159
Synonyms:
4-substituted pyrazoloquinolone, 18
Type:
Small organic molecule
Emp. Form.:
C12H8ClN3O3
Mol. Mass.:
277.663
SMILES:
Cn1c2cc(nn2c(=O)c2cc(Cl)ccc12)C(O)=O
: