Target
Phosphopantetheine adenylyltransferase
Ligand
BDBM82161
Substrate
Meas. Tech.
High-Throughput Screening Assay (Forward Direction Assay)
IC50
5.4e+4±n/a nM
Citation
 Miller, JRThanabal, VMelnick, MMLall, MDonovan, CSarver, RWLee, DYOhren, JEmerson, D The use of biochemical and biophysical tools for triage of high-throughput screening hits - A case study with Escherichia coli phosphopantetheine adenylyltransferase. Chem Biol Drug Des 75:444-54 (2010)  
Target
Name:
Phosphopantetheine adenylyltransferase
Synonyms:
COAD_ECOLI Pantetheine-phosphate adenylyltransferase coaD yicA
Type:
Protein
Mol. Mass.:
17838.96
Organism:
Escherichia coli
Description:
P0A6I6
Residue:
159
  
Inhibitor
Name:
BDBM82161
Synonyms:
6-substituted pyrazoloquinolone, 20
Type:
Small organic molecule
Emp. Form.:
C12H6F3N3O3
Mol. Mass.:
297.1895
SMILES:
OC(=O)c1cc2nc3cc(ccc3c(=O)n2[nH]1)C(F)(F)F
: