Target
Phosphopantetheine adenylyltransferase
Ligand
BDBM82162
Substrate
Meas. Tech.
High-Throughput Screening Assay (Forward Direction Assay)
IC50
1.21e+5±n/a nM
Citation
 Miller, JRThanabal, VMelnick, MMLall, MDonovan, CSarver, RWLee, DYOhren, JEmerson, D The use of biochemical and biophysical tools for triage of high-throughput screening hits - A case study with Escherichia coli phosphopantetheine adenylyltransferase. Chem Biol Drug Des 75:444-54 (2010)  
Target
Name:
Phosphopantetheine adenylyltransferase
Synonyms:
COAD_ECOLI Pantetheine-phosphate adenylyltransferase coaD yicA
Type:
Protein
Mol. Mass.:
17838.96
Organism:
Escherichia coli
Description:
P0A6I6
Residue:
159
  
Inhibitor
Name:
BDBM82162
Synonyms:
6-substituted pyrazoloquinolone, 21
Type:
Small organic molecule
Emp. Form.:
C11H8N4O3
Mol. Mass.:
244.2062
SMILES:
Nc1ccc2c(c1)nc1cc([nH]n1c2=O)C(O)=O
: