Target
Phosphopantetheine adenylyltransferase
Ligand
BDBM82163
Substrate
Meas. Tech.
High-Throughput Screening Assay (Forward Direction Assay)
IC50
1.24e+5±n/a nM
Citation
 Miller, JRThanabal, VMelnick, MMLall, MDonovan, CSarver, RWLee, DYOhren, JEmerson, D The use of biochemical and biophysical tools for triage of high-throughput screening hits - A case study with Escherichia coli phosphopantetheine adenylyltransferase. Chem Biol Drug Des 75:444-54 (2010)  
Target
Name:
Phosphopantetheine adenylyltransferase
Synonyms:
COAD_ECOLI Pantetheine-phosphate adenylyltransferase coaD yicA
Type:
Protein
Mol. Mass.:
17838.96
Organism:
Escherichia coli
Description:
P0A6I6
Residue:
159
  
Inhibitor
Name:
BDBM82163
Synonyms:
6-substituted pyrazoloquinolone, 22
Type:
Small organic molecule
Emp. Form.:
C11H6BrN3O3
Mol. Mass.:
308.088
SMILES:
OC(=O)c1cc2nc3cc(Br)ccc3c(=O)n2[nH]1
: