Target
Phosphopantetheine adenylyltransferase
Ligand
BDBM82151
Substrate
Meas. Tech.
Reverse PPAT Assay
IC50
2.2e+4±n/a nM
Citation
 Miller, JRThanabal, VMelnick, MMLall, MDonovan, CSarver, RWLee, DYOhren, JEmerson, D The use of biochemical and biophysical tools for triage of high-throughput screening hits - A case study with Escherichia coli phosphopantetheine adenylyltransferase. Chem Biol Drug Des 75:444-54 (2010)  
Target
Name:
Phosphopantetheine adenylyltransferase
Synonyms:
COAD_ECOLI Pantetheine-phosphate adenylyltransferase coaD yicA
Type:
Protein
Mol. Mass.:
17838.96
Organism:
Escherichia coli
Description:
P0A6I6
Residue:
159
  
Inhibitor
Name:
BDBM82151
Synonyms:
7-substituted pyrazoloquinolone, 10
Type:
Small organic molecule
Emp. Form.:
C11H6BrN3O3
Mol. Mass.:
308.088
SMILES:
OC(=O)c1cc2nc3ccc(Br)cc3c(=O)n2[nH]1
: