Target
Phosphopantetheine adenylyltransferase
Ligand
BDBM82157
Substrate
Meas. Tech.
Reverse PPAT Assay
IC50
7.1e+3±n/a nM
Citation
 Miller, JRThanabal, VMelnick, MMLall, MDonovan, CSarver, RWLee, DYOhren, JEmerson, D The use of biochemical and biophysical tools for triage of high-throughput screening hits - A case study with Escherichia coli phosphopantetheine adenylyltransferase. Chem Biol Drug Des 75:444-54 (2010)  
Target
Name:
Phosphopantetheine adenylyltransferase
Synonyms:
COAD_ECOLI Pantetheine-phosphate adenylyltransferase coaD yicA
Type:
Protein
Mol. Mass.:
17838.96
Organism:
Escherichia coli
Description:
P0A6I6
Residue:
159
  
Inhibitor
Name:
BDBM82157
Synonyms:
7-substituted pyrazoloquinolone, 16
Type:
Small organic molecule
Emp. Form.:
C13H12N4O3
Mol. Mass.:
272.2594
SMILES:
CN(C)c1ccc2nc3cc([nH]n3c(=O)c2c1)C(O)=O
: