Target
Thymidylate synthase
Ligand
BDBM82167
Substrate
Meas. Tech.
Tritium Release Assay
pH
7.5±0
Temperature
277.15±0 K
IC50
3.0e+4±n/a nM
Kd
5e+3±n/a nM
Citation
 Begley, DWZheng, SVarani, G Fragment-based discovery of novel thymidylate synthase leads by NMR screening and group epitope mapping. Chem Biol Drug Des 76:218-33 (2010)  
Target
Name:
Thymidylate synthase
Synonyms:
TS TYMS Thymidylate synthase (TS) | Thymidylate synthase/GAR transformylase/AICAR transformylase
Type:
Enzyme
Mol. Mass.:
35718.07
Organism:
Homo sapiens (Human)
Description:
Residue:
313
  
Inhibitor
Name:
BDBM82167
Synonyms:
MV1555
Type:
Small organic molecule
Emp. Form.:
C16H16N4OS
Mol. Mass.:
312.389
SMILES:
Cc1c(nnn1-c1ccccc1)C(=O)NCCc1cccs1
: