Target
Thymidylate synthase
Ligand
BDBM82174
Substrate
Meas. Tech.
Tritium Release Assay
pH
7.5±0
Temperature
277.15±0 K
IC50
7.0e+4±n/a nM
Kd
1e+3±n/a nM
Citation
 Begley, DWZheng, SVarani, G Fragment-based discovery of novel thymidylate synthase leads by NMR screening and group epitope mapping. Chem Biol Drug Des 76:218-33 (2010)  
Target
Name:
Thymidylate synthase
Synonyms:
TS TYMS Thymidylate synthase (TS) | Thymidylate synthase/GAR transformylase/AICAR transformylase
Type:
Enzyme
Mol. Mass.:
35718.07
Organism:
Homo sapiens (Human)
Description:
Residue:
313
  
Inhibitor
Name:
BDBM82174
Synonyms:
MV1565
Type:
Small organic molecule
Emp. Form.:
C16H15N3OS
Mol. Mass.:
297.375
SMILES:
CCc1ccc(\C=N\NC(=O)c2c[nH]c3ccccc23)s1
: