Target
Metabotropic glutamate receptor 2
Ligand
BDBM50053589
Substrate
Ki
>10000±n/a nM
Comments
PDSP_4811
Citation
 Thomsen, CBoel, ESuzdak, PD Actions of phenylglycine analogs at subtypes of the metabotropic glutamate receptor family. Eur J Pharmacol 267:77-84 (1994)  
Target
Name:
Metabotropic glutamate receptor 2
Synonyms:
GPRC1B GRM2_HUMAN Metabotropic glutamate receptor mGlu2 | metabotropic glutamate 2
Type:
Enzyme
Mol. Mass.:
95584.88
Organism:
Homo sapiens (Human)
Description:
Q14416
Residue:
872
  
Inhibitor
Name:
BDBM50053589
Synonyms:
(S)-3-Hydroxyphenylglycine 3HPG | CHEMBL442347
Type:
Small organic molecule
Emp. Form.:
C8H9NO3
Mol. Mass.:
167.162
SMILES:
N[C@H](C(O)=O)c1cccc(O)c1
: