Target
Norepinephrine transporter
Ligand
BDBM50003560
Substrate
Ki
179±n/a nM
Comments
PDSP_4111
Citation
 Codd, EEShank, RPSchupsky, JJRaffa, RB Serotonin and norepinephrine uptake inhibiting activity of centrally acting analgesics: structural determinants and role in antinociception. J Pharmacol Exp Ther 274:1263-70 (1995) Target
Name:
Norepinephrine transporter
Synonyms:
Type:
Enzyme Catalytic Domain
Mol. Mass.:
2082.45
Organism:
RAT
Description:
Norepinephrine transporter 0 RAT::Q9JIA2
Residue:
19
MLLARMKPQVQPELGGADQ
  
Inhibitor
Name:
BDBM50003560
Synonyms:
4-methoxy-17-methyl-17-azatetracyclo[7.5.3.01,10.02,7]heptadeca-2(7),3,5-triene CHEMBL22207 Levomethorpan
Type:
Small organic molecule
Emp. Form.:
C18H25NO
Mol. Mass.:
271.3972
SMILES:
COc1ccc2CC3C4CCCCC4(CCN3C)c2c1
: