Target
Kappa-type opioid receptor
Ligand
BDBM50016846
Substrate
Ki
34.6±n/a nM
Comments
PDSP_4112
Citation
 Codd, EEShank, RPSchupsky, JJRaffa, RB Serotonin and norepinephrine uptake inhibiting activity of centrally acting analgesics: structural determinants and role in antinociception. J Pharmacol Exp Ther 274:1263-70 (1995) Target
Name:
Kappa-type opioid receptor
Synonyms:
KOR-1 OPIATE Kappa Opioid receptor Ror-d
Type:
G Protein-Coupled Receptor (GPCR)
Mol. Mass.:
42692.90
Organism:
Rattus norvegicus (rat)
Description:
P34975
Residue:
380
  
Inhibitor
Name:
BDBM50016846
Synonyms:
(levallorphan)17-allyl-(1R,9R)-17-azatetracyclo[7.5.3.01,10.02,7]heptadeca-2(7),3,5-trien-4-ol 17-allyl-17-azatetracyclo[7.5.3.01,10.02,7]heptadeca-2(7),3,5-trien-4-ol (Levallorphan) Dextrallorphan | Levallorphan
Type:
Small organic molecule
Emp. Form.:
C19H25NO
Mol. Mass.:
283.4079
SMILES:
Oc1ccc2C[C@@H]3C4CCCC[C@]4(CCN3CC=C)c2c1
: