Target
Kappa-type opioid receptor
Ligand
BDBM50003560
Substrate
Ki
225±n/a nM
Comments
PDSP_4111
Citation
 Codd, EEShank, RPSchupsky, JJRaffa, RB Serotonin and norepinephrine uptake inhibiting activity of centrally acting analgesics: structural determinants and role in antinociception. J Pharmacol Exp Ther 274:1263-70 (1995) Target
Name:
Kappa-type opioid receptor
Synonyms:
KOR-1 OPIATE Kappa Opioid receptor Ror-d
Type:
G Protein-Coupled Receptor (GPCR)
Mol. Mass.:
42692.90
Organism:
Rattus norvegicus (rat)
Description:
P34975
Residue:
380
  
Inhibitor
Name:
BDBM50003560
Synonyms:
4-methoxy-17-methyl-17-azatetracyclo[7.5.3.01,10.02,7]heptadeca-2(7),3,5-triene CHEMBL22207 Levomethorpan
Type:
Small organic molecule
Emp. Form.:
C18H25NO
Mol. Mass.:
271.3972
SMILES:
COc1ccc2CC3C4CCCCC4(CCN3C)c2c1
: