Target
Mu-type opioid receptor
Ligand
BDBM82268
Substrate
Ki
11.1±n/a nM
Comments
PDSP_4108
Citation
 Codd, EEShank, RPSchupsky, JJRaffa, RB Serotonin and norepinephrine uptake inhibiting activity of centrally acting analgesics: structural determinants and role in antinociception. J Pharmacol Exp Ther 274:1263-70 (1995) Target
Name:
Mu-type opioid receptor
Synonyms:
MOR-1 Mu-type opioid receptor (MOR) OPRM_RAT Opioid receptor B Ror-b
Type:
G Protein-Coupled Receptor (GPCR)
Mol. Mass.:
44503.11
Organism:
Rattus norvegicus (rat)
Description:
Competition binding assays were carried out using membrane preparations from transfected HN9.10 cells that constitutively expressed the mu opioid receptor.
Residue:
398
  
Inhibitor
Name:
BDBM82268
Synonyms:
CAS_553916 NSC_553916
Type:
Small organic molecule
Emp. Form.:
C21H29NO3Si
Mol. Mass.:
371.5454
SMILES:
COc1ccc2CC3C4C=CC(O[Si](C)(C)C)C5Oc1c2C45CCN3C
: