Target
5-hydroxytryptamine receptor 5B
Ligand
BDBM35234
Substrate
Ki
1000±n/a nM
Comments
PDSP_1348
Citation
 Erlander, MGLovenberg, TWBaron, BMde Lecea, LDanielson, PERacke, MSlone, ALSiegel, BWFoye, PECannon, K Two members of a distinct subfamily of 5-hydroxytryptamine receptors differentially expressed in rat brain. Proc Natl Acad Sci U S A 90:3452-6 (1993)  
Target
Name:
5-hydroxytryptamine receptor 5B
Synonyms:
5-HT5B 5HT5B_RAT Htr5b Serotonin 5b (5-HT5b) receptor
Type:
Enzyme Catalytic Domain
Mol. Mass.:
41141.95
Organism:
RAT
Description:
5-HT5B 0 RAT::P35365
Residue:
370
  
Inhibitor
Name:
BDBM35234
Synonyms:
DL-[7-3H]norepinephrine Noradrenaline,(+) | [3H]NE
Type:
radiolabeled ligand
Emp. Form.:
C8H11NO3
Mol. Mass.:
169.1778
SMILES:
NCC(O)c1ccc(O)c(O)c1
: