Target
5-hydroxytryptamine receptor 1A
Ligand
BDBM50035508
Substrate
Ki
0.32±n/a nM
Comments
PDSP_1508
Citation
 Hamon, MLanfumey, Lel Mestikawy, SBoni, CMiquel, MCBolaños, FSchechter, LGozlan, H The main features of central 5-HT1 receptors. Neuropsychopharmacology 3:349-60 (1990) Target
Name:
5-hydroxytryptamine receptor 1A
Synonyms:
5-HT-1A 5-hydroxytryptamine receptor 1A (5-HT-1A) ADRB2RL1 Dopamine D2 receptor and serotonin 1a receptor HTR1A | Serotonin receptor 1A
Type:
Mol. Mass.:
46122.49
Organism:
Homo sapiens (Human)
Description:
Residue:
422
  
Inhibitor
Name:
BDBM50035508
Synonyms:
4-Iodo-N-{2-[4-(2-methoxy-phenyl)-piperazin-1-yl]-ethyl}-N-pyridin-2-yl-benzamide p-MPPI
Type:
Small organic molecule
Emp. Form.:
C25H27IN4O2
Mol. Mass.:
542.4119
SMILES:
COc1ccccc1N1CCN(CCN(C(=O)c2ccc(I)cc2)c2ccccn2)CC1
: