Target
Muscarinic acetylcholine receptor M2
Ligand
BDBM82378
Substrate
Ki
141.25±n/a nM
Comments
PDSP_3905
Citation
 Lazareno, SBuckley, NJRoberts, FF Characterization of muscarinic M4 binding sites in rabbit lung, chicken heart, and NG108-15 cells. Mol Pharmacol 38:805-15 (1990) Target
Name:
Muscarinic acetylcholine receptor M2
Synonyms:
ACM2_RAT Chrm-2 | Chrm2
Type:
Enzyme Catalytic Domain
Mol. Mass.:
51555.53
Organism:
RAT
Description:
P10980
Residue:
466
  
Inhibitor
Name:
BDBM82378
Synonyms:
CAS_82-98-4 Piperidolate
Type:
Small organic molecule
Emp. Form.:
C21H25NO2
Mol. Mass.:
323.4287
SMILES:
CCN1CCCC(C1)OC(=O)C(c1ccccc1)c1ccccc1
: