Target
Cholecystokinin
Ligand
BDBM82386
Substrate
Ki
1100±n/a nM
Comments
PDSP_16
Citation
 Evans, BEBock, MGRittle, KEDiPardo, RMWhitter, WLVeber, DFAnderson, PSFreidinger, RM Design of potent, orally effective, nonpeptidal antagonists of the peptide hormone cholecystokinin. Proc Natl Acad Sci U S A 83:4918-22 (1986)  
Target
Name:
Cholecystokinin
Synonyms:
CCKN_RAT | Cck
Type:
Enzyme Catalytic Domain
Mol. Mass.:
12844.29
Organism:
RAT
Description:
Cholecystokinin 0 RAT::P01355
Residue:
115
  
Inhibitor
Name:
BDBM82386
Synonyms:
CCK antagonist synthetic 15
Type:
Emp. Form.:
C25H19FN4O2
Mol. Mass.:
426.4424
SMILES:
Cc1ccc2c(c[nH]c2c1)C(=O)NC1N=C(c2ccccc2F)c2ccccc2NC1=O
: