Target
Muscarinic acetylcholine receptor M2
Ligand
BDBM50028066
Substrate
Ki
1430±n/a nM
Comments
PDSP_639
Citation
 Cusack, BNelson, ARichelson, E Binding of antidepressants to human brain receptors: focus on newer generation compounds. Psychopharmacology (Berl) 114:559-65 (1994)  
Target
Name:
Muscarinic acetylcholine receptor M2
Synonyms:
ACM2_HUMAN Cholinergic, muscarinic M2 Muscarinic acetylcholine receptor M2 and M5 | RecName: Full=Muscarinic acetylcholine receptor M2
Type:
GPCR
Mol. Mass.:
51730.61
Organism:
Homo sapiens (Human)
Description:
P08172
Residue:
466
  
Inhibitor
Name:
BDBM50028066
Synonyms:
4-(3,4-Dichloro-phenyl)-1,2,3,4-tetrahydro-naphthalen-1-ylamine, HCl Desmethylsertraline
Type:
Small organic molecule
Emp. Form.:
C16H15Cl2N
Mol. Mass.:
292.203
SMILES:
N[C@H]1CC[C@@H](c2ccc(Cl)c(Cl)c2)c2ccccc12
: